Target
Glycogen phosphorylase, muscle form
Ligand
BDBM10849
Substrate
Meas. Tech.
ChEMBL_321369 (CHEMBL881513)
IC50
114000±n/a nM
Citation
 Wen, XSun, HLiu, JWu, GZhang, LWu, XNi, P Pentacyclic triterpenes. Part 1: the first examples of naturally occurring pentacyclic triterpenes as a new class of inhibitors of glycogen phosphorylases. Bioorg Med Chem Lett 15:4944-8 (2005)  
Target
Name:
Glycogen phosphorylase, muscle form
Synonyms:
Glycogen phosphorylase, muscle form Myophosphorylase PYGM_HUMAN
Type:
PROTEIN
Mol. Mass.:
97097.45
Organism:
Homo sapiens (Human)
Description:
ChEMBL_1449751
Residue:
842
  
Inhibitor
Name:
BDBM10849
Synonyms:
1,3,7-trimethyl-2,3,6,7-tetrahydro-1H-purine-2,6-dione CHEMBL113 caffeine
Type:
Small organic molecule
Emp. Form.:
C8H10N4O2
Mol. Mass.:
194.1906
SMILES:
Cn1cnc2n(C)c(=O)n(C)c(=O)c12
: