Target
17-beta-hydroxysteroid dehydrogenase type 1
Ligand
BDBM50370663
Substrate
Meas. Tech.
ChEMBL_321589 (CHEMBL884697)
IC50
10000±n/a nM
Citation
 Fischer, DSAllan, GMBubert, CVicker, NSmith, ATutill, HJPurohit, AWood, LPackham, GMahon, MFReed, MJPotter, BV E-ring modified steroids as novel potent inhibitors of 17beta-hydroxysteroid dehydrogenase type 1. J Med Chem 48:5749-70 (2005)  
Target
Name:
17-beta-hydroxysteroid dehydrogenase type 1
Synonyms:
17-beta-HSD 1 17-beta-hydroxysteroid dehydrogenase type 1 20-alpha-HSD E17KSR EDH17B1 EDHB17 Estradiol 17-beta-dehydrogenase 1 (17beta-HSD1) Placental 17-beta-hydroxysteroid dehydrogenase | SDR28C1
Type:
Enzyme
Mol. Mass.:
34945.13
Organism:
Homo sapiens (Human)
Description:
P14061
Residue:
328
  
Inhibitor
Name:
BDBM50370663
Synonyms:
CHEMBL1627759
Type:
Small organic molecule
Emp. Form.:
C19H21NO2
Mol. Mass.:
295.3755
SMILES:
C[C@]12CC[C@H]3[C@@H](CCc4cc(O)ccc34)[C@@H]1CC(C#N)C2=O
: