Target
Estrogen receptor beta
Ligand
BDBM50178315
Substrate
Meas. Tech.
ChEMBL_332770 (CHEMBL859108)
IC50
381±n/a nM
Citation
 Blizzard, TAGude, CMorgan, JDChan, WBirzin, ETMojena, MTudela, CChen, FKnecht, KSu, QKraker, BMosley, RTHolmes, MASharma, NFitzgerald, PMRohrer, SPHammond, ML Androstenediol analogs as ER-beta-selective SERMs. Bioorg Med Chem Lett 16:834-8 (2006)  
Target
Name:
Estrogen receptor beta
Synonyms:
ER-beta ESR2_HUMAN Estradiol receptor beta (ERβ) Estrogen receptor (ER beta) Estrogen receptor beta (ER beta) NR3A2 estrogen beta
Type:
Protein
Mol. Mass.:
59238.43
Organism:
Homo sapiens (Human)
Description:
Q92731
Residue:
530
  
Inhibitor
Name:
BDBM50178315
Synonyms:
(3S,10S,13S,17S)-13-methyl-10-(prop-1-ynyl)-2,3,4,7,8,9,10,11,12,13,14,15,16,17-tetradecahydro-1H-cyclopenta[a]phenanthrene-3,17-diol | CHEMBL201809
Type:
Small organic molecule
Emp. Form.:
C21H30O2
Mol. Mass.:
314.4617
SMILES:
CC#C[C@]12CC[C@H](O)CC1=CCC1C3CC[C@H](O)[C@@]3(C)CCC21
: