Target
Gonadotropin-releasing hormone receptor
Ligand
BDBM50369395
Substrate
Meas. Tech.
ChEMBL_367963 (CHEMBL871112)
IC50
0.8±n/a nM
Citation
 Imada, TCho, NImaeda, THayase, YSasaki, SKasai, SHarada, MMatsumoto, HEndo, SSuzuki, NFuruya, S Design, synthesis, and structure-activity relationships of thieno[2,3-b]pyridin-4-one derivatives as a novel class of potent, orally active, non-peptide luteinizing hormone-releasing hormone receptor antagonists. J Med Chem 49:3809-25 (2006)  
Target
Name:
Gonadotropin-releasing hormone receptor
Synonyms:
GNRHR GRHR GnRH-R Gonadotropin-releasing hormone receptor | Gonadotropin-releasing hormone receptor (GnRH)
Type:
Enzyme
Mol. Mass.:
37749.45
Organism:
Homo sapiens (Human)
Description:
P30968
Residue:
328
  
Inhibitor
Name:
BDBM50369395
Synonyms:
ELIGARD | LEUPROLIDE
Type:
Small organic molecule
Emp. Form.:
C59H84N16O12
Mol. Mass.:
1209.3983
SMILES:
CCNC(=O)[C@@H]1CCCN1C(=O)[C@H](CCCNC(N)=N)NC(=O)[C@H](CC(C)C)NC(=O)[C@@H](CC(C)C)NC(=O)[C@H](Cc1ccc(O)cc1)NC(=O)[C@H](CO)NC(=O)[C@H](Cc1c[nH]c2ccccc12)NC(=O)[C@H](Cc1cnc[nH]1)NC(=O)[C@@H]1CCC(=O)N1
: