Target
2-dehydropantoate 2-reductase
Ligand
BDBM92459
Substrate
Meas. Tech.
ChEMBL_382751 (CHEMBL854530)
Kd
373000±n/a nM
Citation
 Ciulli, AWilliams, GSmith, AGBlundell, TLAbell, C Probing hot spots at protein-ligand binding sites: a fragment-based approach using biophysical methods. J Med Chem 49:4992-5000 (2006)  
Target
Name:
2-dehydropantoate 2-reductase
Synonyms:
Ketopantoate reductase apbA | panE
Type:
PROTEIN
Mol. Mass.:
33866.35
Organism:
Escherichia coli (strain K12)
Description:
ChEMBL_382751
Residue:
303
  
Inhibitor
Name:
BDBM92459
Synonyms:
CHEMBL384759 Guanosine Diphosphate
Type:
Small molecule
Emp. Form.:
C10H15N5O11P2
Mol. Mass.:
443.2005
SMILES:
Nc1nc2n(cnc2c(=O)[nH]1)[C@@H]1O[C@H](COP(O)(=O)OP(O)(O)=O)[C@@H](O)[C@H]1O
: