Target
Mu-type opioid receptor
Ligand
BDBM50199896
Substrate
Meas. Tech.
ChEMBL_422416 (CHEMBL909851)
Ki
0.620000±n/a nM
Citation
 Le Bourdonnec, BGoodman, AJGraczyk, TMBelanger, SSeida, PRDeHaven, RNDolle, RE Synthesis and pharmacological evaluation of novel octahydro-1H-pyrido[1,2-a]pyrazine as mu-opioid receptor antagonists. J Med Chem 49:7290-306 (2006)  
Target
Name:
Mu-type opioid receptor
Synonyms:
M-OR-1 MOR-1 MUOR1 Mu opiate receptor OPRM1 hMOP | mu-type opioid receptor isoform MOR-1
Type:
G Protein-Coupled Receptor (GPCR)
Mol. Mass.:
44789.51
Organism:
Homo sapiens (Human)
Description:
P35372
Residue:
400
  
Inhibitor
Name:
BDBM50199896
Synonyms:
3-((2R,3R,7S,9-alpha-S)-2,3-dimethyl-7-phenyl-octahydro-1H-quinolizin-2-yl)phenol CHEMBL426523 | US8580788, 56
Type:
Small organic molecule
Emp. Form.:
C23H29NO
Mol. Mass.:
335.4825
SMILES:
C[C@H]1CN2C[C@@H](CC[C@H]2C[C@@]1(C)c1cccc(O)c1)c1ccccc1
: