Target
Potassium voltage-gated channel subfamily H member 2
Ligand
BDBM22890
Substrate
Meas. Tech.
ChEMBL_424195 (CHEMBL907269)
IC50
>30000±n/a nM
Citation
 Zhu, BYJia, ZJZhang, PSu, THuang, WGoldman, ETumas, DKadambi, VEddy, PSinha, UScarborough, RMSong, Y Inhibitory effect of carboxylic acid group on hERG binding. Bioorg Med Chem Lett 16:5507-12 (2006)  
Target
Name:
Potassium voltage-gated channel subfamily H member 2
Synonyms:
1,3-beta-glucan synthase component GLS2 ERG Eag-related protein 1 Ether-a-go-go-related gene (HERG) Ether-a-go-go-related gene potassium channel 1 Ether-a-go-go-related gene potassium channel 1 (hERG1) Ether-a-go-go-related protein 1 H-ERG KCNH2 Potassium voltage-gated channel subfamily H member 2 (hERG) Voltage-gated potassium channel subunit Kv11.1 hERG Potassium Channel 1 | putative potassium channel subunit
Type:
Multi-pass membrane protein
Mol. Mass.:
126672.65
Organism:
Homo sapiens (Human)
Description:
Q12809
Residue:
1159
  
Inhibitor
Name:
BDBM22890
Synonyms:
2-(2-{4-[(4-chlorophenyl)(phenyl)methyl]piperazin-1-yl}ethoxy)acetic acid Cetirizine | Levocetirizine
Type:
Small organic molecule
Emp. Form.:
C21H25ClN2O3
Mol. Mass.:
388.888
SMILES:
OC(=O)COCCN1CCN(CC1)C(c1ccccc1)c1ccc(Cl)cc1
: