Target
Fatty-acid amide hydrolase 1
Ligand
BDBM50204483
Substrate
Meas. Tech.
ChEMBL_428054 (CHEMBL914372)
Ki
0.8±n/a nM
Citation
 Romero, FADu, WHwang, IRayl, TJKimball, FSLeung, DHoover, HSApodaca, RLBreitenbucher, JGCravatt, BFBoger, DL Potent and selective alpha-ketoheterocycle-based inhibitors of the anandamide and oleamide catabolizing enzyme, fatty acid amide hydrolase. J Med Chem 50:1058-68 (2007)  
Target
Name:
Fatty-acid amide hydrolase 1
Synonyms:
Anandamide amidohydrolase FAAH FAAH1_HUMAN Fatty-acid amide hydrolase (FAAH) Oleamide hydrolase 1
Type:
Protein
Mol. Mass.:
63071.19
Organism:
Homo sapiens (Human)
Description:
O00519
Residue:
579
  
Inhibitor
Name:
BDBM50204483
Synonyms:
7-phenyl-1-(5-(trifluoromethyl)oxazol-2-yl)heptan-1-one | CHEMBL373606
Type:
Small organic molecule
Emp. Form.:
C17H18F3NO2
Mol. Mass.:
325.3255
SMILES:
FC(F)(F)c1cnc(o1)C(=O)CCCCCCc1ccccc1
: