Target
RmtA
Ligand
BDBM50336799
Substrate
Meas. Tech.
ChEMBL_428528 (CHEMBL919885)
IC50
5900±n/a nM
Citation
 Ragno, RSimeoni, SCastellano, SVicidomini, CMai, ACaroli, ATramontano, ABonaccini, CTrojer, PBauer, IBrosch, GSbardella, G Small molecule inhibitors of histone arginine methyltransferases: homology modeling, molecular docking, binding mode analysis, and biological evaluations. J Med Chem 50:1241-53 (2007)  
Target
Name:
RmtA
Synonyms:
Type:
PROTEIN
Mol. Mass.:
39351.26
Organism:
Emericella nidulans
Description:
ChEMBL_475539
Residue:
345
  
Inhibitor
Name:
BDBM50336799
Synonyms:
5,5',5''-[1,3,6-naphthalenetriyltris(sulfonylimino)]tris[1,3-benzenesulfonate analogue 8,8'-[CARBONYLBIS[IMINO-3,1-PHENYLENECARBONYLIMINO(4-METHYL-3,1-PHENYLENE)CARBONYLIMINO]]BIS-1,3,5-NAPHTHALENETRISULFONIC ACID 8-[(4-methyl-3-{[3-({[3-({2-methyl-5-[(4,6,8-trisulfonaphthalen-1-yl)carbamoyl]phenyl}carbamoyl)phenyl]carbamoyl}amino)benzene]amido}benzene)amido]naphthalene-1,3,5-trisulfonic acid Germanin US8835659, Suramin suramin
Type:
Small organic molecule
Emp. Form.:
C51H40N6O23S6
Mol. Mass.:
1297.28
SMILES:
Cc1ccc(cc1NC(=O)c1cccc(NC(=O)Nc2cccc(c2)C(=O)Nc2cc(ccc2C)C(=O)Nc2ccc(c3cc(cc(c23)S(O)(=O)=O)S(O)(=O)=O)S(O)(=O)=O)c1)C(=O)Nc1ccc(c2cc(cc(c12)S(O)(=O)=O)S(O)(=O)=O)S(O)(=O)=O
: