Target
25-hydroxyvitamin D-1 alpha hydroxylase, mitochondrial
Ligand
BDBM50370925
Substrate
Meas. Tech.
ChEMBL_430508 (CHEMBL917757)
IC50
554±n/a nM
Citation
 Kahraman, MSinishtaj, SDolan, PMKensler, TWPeleg, SSaha, UChuang, SSBernstein, GKorczak, BPosner, GH Potent, selective and low-calcemic inhibitors of CYP24 hydroxylase: 24-sulfoximine analogues of the hormone 1alpha,25-dihydroxyvitamin D(3). J Med Chem 47:6854-63 (2004)  
Target
Name:
25-hydroxyvitamin D-1 alpha hydroxylase, mitochondrial
Synonyms:
25-hydroxyvitamin D-1 alpha hydroxylase, mitochondrial CYP1ALPHA CYP27B1 | Cytochrome P450 27B1
Type:
Protein
Mol. Mass.:
56522.50
Organism:
Homo sapiens (Human)
Description:
O15528
Residue:
508
  
Inhibitor
Name:
BDBM50370925
Synonyms:
CHEMBL1627233
Type:
Small organic molecule
Emp. Form.:
C29H41NO3S
Mol. Mass.:
483.706
SMILES:
C[C@H](CC=S(N)(=O)c1ccccc1)[C@H]1CC[C@H]2\C(CCC[C@]12C)=C\C=C1\C[C@@H](O)C[C@H](O)C1=C
: