Target
Protein arginine N-methyltransferase 1 [11-371]
Ligand
BDBM50210461
Substrate
Meas. Tech.
ChEMBL_434655 (CHEMBL914212)
IC50
56900±n/a nM
Citation
 Spannhoff, AHeinke, RBauer, ITrojer, PMetzger, EGust, RSchüle, RBrosch, GSippl, WJung, M Target-based approach to inhibitors of histone arginine methyltransferases. J Med Chem 50:2319-25 (2007)  
Target
Name:
Protein arginine N-methyltransferase 1 [11-371]
Synonyms:
ANM1_HUMAN HRMT1L2 PRMT1 Protein arginine methyltransferase 1 (PRMT1) | Protein-arginine N-methyltransferase 1
Type:
Protein
Mol. Mass.:
41506.52
Organism:
Homo sapiens (Human)
Description:
Q99873[11-371]
Residue:
361
  
Inhibitor
Name:
BDBM50210461
Synonyms:
(stilbamidine)4-[2-[4-amino(imino)methylphenyl]-(E)-1-ethenyl]phenyl-iminomethanamine 4-((E)-2-{4-[(Z)-amino(imino)methyl]phenyl}vinyl)benzenecarboximidamide CHEMBL142304 stilbamidine
Type:
Small organic molecule
Emp. Form.:
C16H16N4
Mol. Mass.:
264.325
SMILES:
NC(=N)c1ccc(\C=C\c2ccc(cc2)C(N)=N)cc1
: