Target
Aromatase
Ligand
BDBM50213236
Substrate
Meas. Tech.
ChEMBL_436856 (CHEMBL905158)
IC50
4750±n/a nM
Citation
 Maiti, ACuendet, MCroy, VLEndringer, DCPezzuto, JMCushman, M Synthesis and biological evaluation of (+/-)-abyssinone II and its analogues as aromatase inhibitors for chemoprevention of breast cancer. J Med Chem 50:2799-806 (2007)  
Target
Name:
Aromatase
Synonyms:
ARO1 CP19A_HUMAN CYP19 CYPXIX Cytochrome P450 19A1 Cytochrome P450-C19 (CYP19) FL cytokine receptor precursor | P-450AROM
Type:
Enzyme
Mol. Mass.:
57888.92
Organism:
Homo sapiens (Human)
Description:
P11511
Residue:
503
  
Inhibitor
Name:
BDBM50213236
Synonyms:
2-[4-hydroxy-3-(3-methylbut-2-enyl)phenyl]-7-methoxychroman-4-one | CHEMBL388374
Type:
Small organic molecule
Emp. Form.:
C21H22O4
Mol. Mass.:
338.397
SMILES:
[#6]-[#8]-c1ccc2-[#6](=O)-[#6]-[#6](-[#8]-c2c1)-c1ccc(-[#8])c(-[#6]\[#6]=[#6](\[#6])-[#6])c1
: