Target
Aromatase
Ligand
BDBM50213252
Substrate
Meas. Tech.
ChEMBL_436856 (CHEMBL905158)
IC50
7670±n/a nM
Citation
 Maiti, ACuendet, MCroy, VLEndringer, DCPezzuto, JMCushman, M Synthesis and biological evaluation of (+/-)-abyssinone II and its analogues as aromatase inhibitors for chemoprevention of breast cancer. J Med Chem 50:2799-806 (2007)  
Target
Name:
Aromatase
Synonyms:
ARO1 CP19A_HUMAN CYP19 CYPXIX Cytochrome P450 19A1 Cytochrome P450-C19 (CYP19) FL cytokine receptor precursor | P-450AROM
Type:
Enzyme
Mol. Mass.:
57888.92
Organism:
Homo sapiens (Human)
Description:
P11511
Residue:
503
  
Inhibitor
Name:
BDBM50213252
Synonyms:
2-[4-methoxy-3-(3-methylbut-2-enyl)phenyl]-7-(methoxymethoxy)chroman-4-one | CHEMBL425670
Type:
Small organic molecule
Emp. Form.:
C23H26O5
Mol. Mass.:
382.4495
SMILES:
[#6]-[#8]-[#6]-[#8]-c1ccc2-[#6](=O)-[#6]-[#6](-[#8]-c2c1)-c1ccc(-[#8]-[#6])c(-[#6]\[#6]=[#6](\[#6])-[#6])c1
: