Target
Estrogen receptor beta
Ligand
BDBM50223229
Substrate
Meas. Tech.
ChEMBL_458135 (CHEMBL925468)
IC50
9.4±n/a nM
Citation
 Blizzard, TAGude, CMorgan, JDChan, WBirzin, ETMojena, MTudela, CChen, FKnecht, KSu, QKraker, BMosley, RTHolmes, MARohrer, SPHammond, ML Androstene-3,5-dienes as ER-beta selective SERMs. Bioorg Med Chem Lett 17:6295-8 (2007)  
Target
Name:
Estrogen receptor beta
Synonyms:
ER-beta ESR2_HUMAN Estradiol receptor beta (ERβ) Estrogen receptor (ER beta) Estrogen receptor beta (ER beta) NR3A2 estrogen beta
Type:
Protein
Mol. Mass.:
59238.43
Organism:
Homo sapiens (Human)
Description:
Q92731
Residue:
530
  
Inhibitor
Name:
BDBM50223229
Synonyms:
(8R,9S,10R,13S,14S,17S)-3,10,13-trimethyl-2,7,8,9,10,11,12,13,14,15,16,17-dodecahydro-1H-cyclopenta[a]phenanthren-17-ol | CHEMBL250110
Type:
Small organic molecule
Emp. Form.:
C20H30O
Mol. Mass.:
286.4516
SMILES:
CC1=CC2=CC[C@H]3[C@@H]4CC[C@H](O)[C@@]4(C)CC[C@@H]3[C@@]2(C)CC1
: