Target
Cathepsin G
Ligand
BDBM50069989
Substrate
Meas. Tech.
ChEMBL_464561 (CHEMBL933247)
IC50
520±n/a nM
Citation
 Dorsey, BDIqbal, MChatterjee, SMenta, EBernardini, RBernareggi, ACassarà, PGD'Arasmo, GFerretti, EDe Munari, SOliva, APezzoni, GAllievi, CStrepponi, IRuggeri, BAtor, MAWilliams, MMallamo, JP Discovery of a potent, selective, and orally active proteasome inhibitor for the treatment of cancer. J Med Chem 51:1068-72 (2008)  
Target
Name:
Cathepsin G
Synonyms:
CATG_HUMAN CTSG
Type:
PROTEIN
Mol. Mass.:
28860.08
Organism:
Homo sapiens (Human)
Description:
ChEMBL_1469016
Residue:
255
  
Inhibitor
Name:
BDBM50069989
Synonyms:
(R)-3-methyl-1-((S)-3-phenyl-2-(pyrazine-2-carboxamido)propanamido)butylboronic acid BORTEZOMIB Dipeptidyl boronic acid derivative N-[(1R)-1-(DIHYDROXYBORYL)-3-METHYLBUTYL]-N-(PYRAZIN-2-YLCARBONYL)-L-PHENYLALANINAMIDE Peptidyl boronic acid derivative Velcade | cid_387447
Type:
Small organic molecule
Emp. Form.:
C19H25BN4O4
Mol. Mass.:
384.237
SMILES:
CC(C)C[C@H](NC(=O)[C@H](Cc1ccccc1)NC(=O)c1cnccn1)B(O)O
: