Target
Androgen receptor
Ligand
BDBM35909
Substrate
Meas. Tech.
ChEMBL_464721 (CHEMBL933064)
IC50
26±n/a nM
Citation
 Salvati, MEBalog, AShan, WRampulla, RGiese, SMitt, TFurch, JAVite, GDAttar, RMJure-Kunkel, MGeng, JRizzo, CAGottardis, MMKrystek, SRGougoutas, JGalella, MAObermeier, MFura, AChandrasena, G Identification and optimization of a novel series of [2.2.1]-oxabicyclo imide-based androgen receptor antagonists. Bioorg Med Chem Lett 18:1910-5 (2008)  
Target
Name:
Androgen receptor
Synonyms:
ANDR_HUMAN Androgen Receptor Androgen receptor/Baculoviral IAP repeat-containing protein 2 Dihydrotestosterone receptor Nuclear receptor subfamily 3 group C member 4
Type:
Receptor
Mol. Mass.:
99185.27
Organism:
Homo sapiens (Human)
Description:
CHO cells were stably transfected with human AR gene.
Residue:
920
  
Inhibitor
Name:
BDBM35909
Synonyms:
2-Hydroxy-2-methyl-N-(4-nitro-3-trifluoromethyl-phenyl)-propionamide 2-Hydroxy-2-methyl-N-(4-nitro-3-trifluoromethyl-phenyl)-propionamide(Hydroxyflutamide) CHEMBL491 Hydroxyflutamide Sch 16423 cid_91649 | hydroxy-flutamide
Type:
Small organic molecule
Emp. Form.:
C11H11F3N2O4
Mol. Mass.:
292.2112
SMILES:
CC(C)(O)C(=O)Nc1ccc(c(c1)C(F)(F)F)[N+]([O-])=O
: