Target
cGMP-inhibited 3',5'-cyclic phosphodiesterase 3A
Ligand
BDBM14759
Substrate
Meas. Tech.
ChEMBL_466943 (CHEMBL933708)
Ki
226±n/a nM
Citation
 Kulkarni, SSPatel, MRTalele, TT CoMFA and HQSAR studies on 6,7-dimethoxy-4-pyrrolidylquinazoline derivatives as phosphodiesterase10A inhibitors. Bioorg Med Chem 16:3675-86 (2008)  
Target
Name:
cGMP-inhibited 3',5'-cyclic phosphodiesterase 3A
Synonyms:
3',5'-cyclic phosphodiesterase Cyclic GMP-inhibited phosphodiesterase A PDE3A_HUMAN Phosphodiesterase 3 (PDE3) Phosphodiesterase 3A Phosphodiesterase 3A (PDE3A1) cGMP-inhibited 3',5'-cyclic phosphodiesterase A | cGMP-inhibited 3,5-cyclic phosphodiesterase A
Type:
Enzyme
Mol. Mass.:
124966.46
Organism:
Homo sapiens (Human)
Description:
Q14432
Residue:
1141
  
Inhibitor
Name:
BDBM14759
Synonyms:
(R)-6,7-Dimethoxy-4-[3-(pyridin-4-yloxy)-pyrrolidin-1-yl]-quinazoline 6,7-dimethoxy-4-[(3R)-3-(pyridin-4-yloxy)pyrrolidin-1-yl]quinazoline
Type:
Small organic molecule
Emp. Form.:
C19H20N4O3
Mol. Mass.:
352.3871
SMILES:
COc1cc2ncnc(N3CC[C@H](C3)Oc3ccncc3)c2cc1OC
: