Target
Cathepsin D
Ligand
BDBM50231682
Substrate
Meas. Tech.
ChEMBL_468540 (CHEMBL931965)
IC50
2695±n/a nM
Citation
 Clarke, BDemont, EDingwall, CDunsdon, RFaller, AHawkins, JHussain, IMacPherson, DMaile, GMatico, RMilner, PMosley, JNaylor, AO'Brien, ARedshaw, SRiddell, DRowland, PSoleil, VSmith, KJStanway, SStemp, GSweitzer, STheobald, PVesey, DWalter, DSWard, JWayne, G BACE-1 inhibitors part 1: identification of novel hydroxy ethylamines (HEAs). Bioorg Med Chem Lett 18:1011-6 (2008)  
Target
Name:
Cathepsin D
Synonyms:
CATD_HUMAN CTSD Cathepsin D heavy chain Cathepsin D precursor
Type:
Enzyme
Mol. Mass.:
44551.72
Organism:
Homo sapiens (Human)
Description:
Human proCathepsin D (SwissProt accession number P07339) was expressed in Sf9 cells, purified, and autoactivated.
Residue:
412
  
Inhibitor
Name:
BDBM50231682
Synonyms:
CHEMBL251862 | N-((2S,3R)-4-((S)-1-(cyclohexylamino)-1-oxopropan-2-ylamino)-3-hydroxy-1-phenylbutan-2-yl)-3-(ethylamino)-5-(2-oxopyrrolidin-1-yl)benzamide
Type:
Small organic molecule
Emp. Form.:
C32H45N5O4
Mol. Mass.:
563.7308
SMILES:
CCNc1cc(cc(c1)C(=O)N[C@@H](Cc1ccccc1)[C@H](O)CN[C@@H](C)C(=O)NC1CCCCC1)N1CCCC1=O
: