Target
Protein-arginine deiminase type-4
Ligand
BDBM50422012
Substrate
Meas. Tech.
ChEMBL_468734 (CHEMBL929916)
Ki
180000±n/a nM
Citation
 Knuckley, BLuo, YThompson, PR Profiling Protein Arginine Deiminase 4 (PAD4): a novel screen to identify PAD4 inhibitors. Bioorg Med Chem 16:739-45 (2008)  
Target
Name:
Protein-arginine deiminase type-4
Synonyms:
PAD4 PADI4_HUMAN PDI5
Type:
Enzyme Catalytic Domain
Mol. Mass.:
74078.90
Organism:
Homo sapiens (Human)
Description:
gi_216548487
Residue:
663
  
Inhibitor
Name:
BDBM50422012
Synonyms:
Klinomycin Minocin | Vectrin
Type:
Small organic molecule
Emp. Form.:
C23H27N3O7
Mol. Mass.:
457.4764
SMILES:
CN(C)[C@H]1[C@@H]2C[C@@H]3Cc4c(ccc(O)c4C(=O)C3C(=O)[C@]2(O)C(=O)C(C(N)=O)C1=O)N(C)C
: