Target
Lanosterol 14-alpha demethylase
Ligand
BDBM50375318
Substrate
Meas. Tech.
ChEMBL_470779 (CHEMBL934981)
IC50
3000±n/a nM
Citation
 Ekins, SMankowski, DCHoover, DJLawton, MPTreadway, JLHarwood, HJ Three-dimensional quantitative structure-activity relationship analysis of human CYP51 inhibitors. Drug Metab Dispos 35:493-500 (2007)  
Target
Name:
Lanosterol 14-alpha demethylase
Synonyms:
CP51A_HUMAN CYP51A1 Cytochrome P450 51 LDM P450-14DM P450LI Sterol 14-alpha demethylase
Type:
Protein
Mol. Mass.:
56817.21
Organism:
Homo sapiens (Human)
Description:
Q16850
Residue:
503
  
Inhibitor
Name:
BDBM50375318
Synonyms:
Fungistat Panlomyc TERCONAZOLE Terazol 3 med.21724, Compound Terconazole
Type:
Small organic molecule
Emp. Form.:
C26H31Cl2N5O3
Mol. Mass.:
532.462
SMILES:
CC(C)N1CCN(CC1)c1ccc(OC[C@H]2CO[C@@](Cn3cncn3)(O2)c2ccc(Cl)cc2Cl)cc1
: