Target
Progesterone receptor
Ligand
BDBM50375432
Substrate
Meas. Tech.
ChEMBL_472013 (CHEMBL940096)
EC50
0.49±n/a nM
Citation
 Rewinkel, JEnthoven, MGolstein, Ivan der Rijst, MScholten, Avan Tilborg, Mde Weys, DWisse, JHamersma, H 11-(pyridinylphenyl)steroids--a new class of mixed-profile progesterone agonists/antagonists. Bioorg Med Chem 16:2753-63 (2008)  
Target
Name:
Progesterone receptor
Synonyms:
NR3C3 PGR PRGR_HUMAN | progesterone
Type:
Protein
Mol. Mass.:
98979.52
Organism:
Homo sapiens (Human)
Description:
P06401
Residue:
933
  
Inhibitor
Name:
BDBM50375432
Synonyms:
CHEMBL258521
Type:
Small organic molecule
Emp. Form.:
C34H36FNO2
Mol. Mass.:
509.6535
SMILES:
C[C@@H]1C[C@H]2[C@@H]3CCC4=CC(=O)CCC4=C3[C@H](C[C@]2(C)[C@H]1C(=O)C1CC1)c1ccc(cc1)-c1ccc(F)nc1
: