Target
RmtA
Ligand
BDBM50376138
Substrate
Meas. Tech.
ChEMBL_475539 (CHEMBL925748)
IC50
122300±n/a nM
Citation
 Mai, ACheng, DBedford, MTValente, SNebbioso, APerrone, ABrosch, GSbardella, GDe Bellis, FMiceli, MAltucci, L epigenetic multiple ligands: mixed histone/protein methyltransferase, acetyltransferase, and class III deacetylase (sirtuin) inhibitors. J Med Chem 51:2279-90 (2008)  
Target
Name:
RmtA
Synonyms:
Type:
PROTEIN
Mol. Mass.:
39351.26
Organism:
Emericella nidulans
Description:
ChEMBL_475539
Residue:
345
  
Inhibitor
Name:
BDBM50376138
Synonyms:
CHEMBL259612
Type:
Small organic molecule
Emp. Form.:
C20H12Br4N2O4
Mol. Mass.:
663.936
SMILES:
Oc1c(Br)cc(cc1Br)C(=O)Nc1ccc(NC(=O)c2cc(Br)c(O)c(Br)c2)cc1
: