Target
RmtA
Ligand
BDBM50376166
Substrate
Meas. Tech.
ChEMBL_475539 (CHEMBL925748)
IC50
29000±n/a nM
Citation
 Mai, ACheng, DBedford, MTValente, SNebbioso, APerrone, ABrosch, GSbardella, GDe Bellis, FMiceli, MAltucci, L epigenetic multiple ligands: mixed histone/protein methyltransferase, acetyltransferase, and class III deacetylase (sirtuin) inhibitors. J Med Chem 51:2279-90 (2008)  
Target
Name:
RmtA
Synonyms:
Type:
PROTEIN
Mol. Mass.:
39351.26
Organism:
Emericella nidulans
Description:
ChEMBL_475539
Residue:
345
  
Inhibitor
Name:
BDBM50376166
Synonyms:
CHEMBL259324
Type:
Small organic molecule
Emp. Form.:
C19H12Br4O4
Mol. Mass.:
623.912
SMILES:
Oc1c(Br)cc(\C=C2/COC\C(=C/c3cc(Br)c(O)c(Br)c3)C2=O)cc1Br
: