Target
Cholinesterase
Ligand
BDBM50377921
Substrate
Meas. Tech.
ChEMBL_552873 (CHEMBL960590)
IC50
12.4±n/a nM
Citation
 Camps, PFormosa, XGaldeano, CGómez, TMuñoz-Torrero, DScarpellini, MViayna, EBadia, AClos, MVCamins, APallàs, MBartolini, MMancini, FAndrisano, VEstelrich, JLizondo, MBidon-Chanal, ALuque, FJ Novel donepezil-based inhibitors of acetyl- and butyrylcholinesterase and acetylcholinesterase-induced beta-amyloid aggregation. J Med Chem 51:3588-98 (2008)  
Target
Name:
Cholinesterase
Synonyms:
Acylcholine acylhydrolase Butyrylcholine esterase (BChE) Butyrylcholinesterase (BuChE) CHLE_HUMAN Cholinesterases Pseudocholinesterase
Type:
Homotetramer
Mol. Mass.:
68422.27
Organism:
Homo sapiens (Human)
Description:
P06276
Residue:
602
  
Inhibitor
Name:
BDBM50377921
Synonyms:
SODIUM NITROPRUSSIDE
Type:
Small organic molecule
Emp. Form.:
C5FeN6O
Mol. Mass.:
215.939
SMILES:
O=N[Fe--](C#N)(C#N)(C#N)(C#N)C#N
: