Target
Solute carrier family 22 member 20
Ligand
BDBM50270021
Substrate
Meas. Tech.
ChEMBL_508178 (CHEMBL1008236)
Ki
5410000±n/a nM
Citation
 Kaler, GTruong, DMKhandelwal, ANagle, MEraly, SASwaan, PWNigam, SK Structural variation governs substrate specificity for organic anion transporter (OAT) homologs. Potential remote sensing by OAT family members. J Biol Chem 282:23841-53 (2007)  
Target
Name:
Solute carrier family 22 member 20
Synonyms:
Gm963 S22AK_MOUSE | Slc22a20
Type:
PROTEIN
Mol. Mass.:
60953.19
Organism:
Mus musculus
Description:
ChEMBL_508178
Residue:
556
  
Inhibitor
Name:
BDBM50270021
Synonyms:
glutarate pentanedioate
Type:
Small organic molecule
Emp. Form.:
C5H6O4
Mol. Mass.:
130.0998
SMILES:
[O-]C(=O)CCCC([O-])=O
: