Target
Potassium voltage-gated channel subfamily H member 2
Ligand
BDBM50241365
Substrate
Meas. Tech.
ChEMBL_534565 (CHEMBL988126)
IC50
810±n/a nM
Citation
 Thai, KMEcker, GF A binary QSAR model for classification of hERG potassium channel blockers. Bioorg Med Chem 16:4107-19 (2008)  
Target
Name:
Potassium voltage-gated channel subfamily H member 2
Synonyms:
1,3-beta-glucan synthase component GLS2 ERG Eag-related protein 1 Ether-a-go-go-related gene (HERG) Ether-a-go-go-related gene potassium channel 1 Ether-a-go-go-related gene potassium channel 1 (hERG1) Ether-a-go-go-related protein 1 H-ERG KCNH2 Potassium voltage-gated channel subfamily H member 2 (hERG) Voltage-gated potassium channel subunit Kv11.1 hERG Potassium Channel 1 | putative potassium channel subunit
Type:
Multi-pass membrane protein
Mol. Mass.:
126672.65
Organism:
Homo sapiens (Human)
Description:
Q12809
Residue:
1159
  
Inhibitor
Name:
BDBM50241365
Synonyms:
(R)-9-methyl-3-((2-methyl-1H-imidazol-1-yl)methyl)-2,3-dihydro-1H-carbazol-4(9H)-one ONDANSETRON
Type:
Small organic molecule
Emp. Form.:
C18H19N3O
Mol. Mass.:
293.363
SMILES:
Cc1nccn1C[C@H]1CCc2c(C1=O)c1ccccc1n2C
: