Target
Ectonucleoside triphosphate diphosphohydrolase 1
Ligand
BDBM50336799
Substrate
Meas. Tech.
ChEMBL_514528 (CHEMBL968882)
Ki
300000±n/a nM
Citation
 Brunschweiger, AIqbal, JUmbach, FScheiff, ABMunkonda, MNSévigny, JKnowles, AFMüller, CE Selective nucleoside triphosphate diphosphohydrolase-2 (NTPDase2) inhibitors: nucleotide mimetics derived from uridine-5'-carboxamide. J Med Chem 51:4518-28 (2008)  
Target
Name:
Ectonucleoside triphosphate diphosphohydrolase 1
Synonyms:
ATPDase Cd39 Ecto-ATP diphosphohydrolase Entpd1 NTPDase 1
Type:
PROTEIN
Mol. Mass.:
57412.31
Organism:
Rattus norvegicus
Description:
ChEMBL_463990
Residue:
511
  
Inhibitor
Name:
BDBM50336799
Synonyms:
5,5',5''-[1,3,6-naphthalenetriyltris(sulfonylimino)]tris[1,3-benzenesulfonate analogue 8,8'-[CARBONYLBIS[IMINO-3,1-PHENYLENECARBONYLIMINO(4-METHYL-3,1-PHENYLENE)CARBONYLIMINO]]BIS-1,3,5-NAPHTHALENETRISULFONIC ACID 8-[(4-methyl-3-{[3-({[3-({2-methyl-5-[(4,6,8-trisulfonaphthalen-1-yl)carbamoyl]phenyl}carbamoyl)phenyl]carbamoyl}amino)benzene]amido}benzene)amido]naphthalene-1,3,5-trisulfonic acid Germanin US8835659, Suramin suramin
Type:
Small organic molecule
Emp. Form.:
C51H40N6O23S6
Mol. Mass.:
1297.28
SMILES:
Cc1ccc(cc1NC(=O)c1cccc(NC(=O)Nc2cccc(c2)C(=O)Nc2cc(ccc2C)C(=O)Nc2ccc(c3cc(cc(c23)S(O)(=O)=O)S(O)(=O)=O)S(O)(=O)=O)c1)C(=O)Nc1ccc(c2cc(cc(c12)S(O)(=O)=O)S(O)(=O)=O)S(O)(=O)=O
: