Target
Adenosine receptor A2a
Ligand
BDBM50262435
Substrate
Meas. Tech.
ChEMBL_509569 (CHEMBL1000455)
Ki
32±n/a nM
Citation
 Mantri, Mde Graaf, Ovan Veldhoven, JGöblyös, Avon Frijtag Drabbe Künzel, JKMulder-Krieger, TLink, Rde Vries, HBeukers, MWBrussee, JIjzerman, AP 2-Amino-6-furan-2-yl-4-substituted nicotinonitriles as A2A adenosine receptor antagonists. J Med Chem 51:4449-55 (2008)  
Target
Name:
Adenosine receptor A2a
Synonyms:
A2A adenosine receptor (hA2A) ADENOSINE A2 ADORA2 Adenosine A2A receptor (A2AAR)
Type:
G Protein-Coupled Receptor (GPCR)
Mol. Mass.:
44716.46
Organism:
Homo sapiens (Human)
Description:
P29274
Residue:
412
  
Inhibitor
Name:
BDBM50262435
Synonyms:
2-Amino-4,6-di-thiophen-2-yl-nicotinonitrile | CHEMBL455264
Type:
Small organic molecule
Emp. Form.:
C14H9N3S2
Mol. Mass.:
283.371
SMILES:
Nc1nc(cc(-c2cccs2)c1C#N)-c1cccs1
: