Target
Solute carrier family 22 member 1
Ligand
BDBM50080092
Substrate
Meas. Tech.
ChEMBL_534654 (CHEMBL994103)
IC50
35100±n/a nM
Citation
 Ahlin, GKarlsson, JPedersen, JMGustavsson, LLarsson, RMatsson, PNorinder, UBergström, CAArtursson, P Structural requirements for drug inhibition of the liver specific human organic cation transport protein 1. J Med Chem 51:5932-42 (2008)  
Target
Name:
Solute carrier family 22 member 1
Synonyms:
Adrenergic Alpha Organic cation transporter 1 SLC22A1 hOCT1
Type:
Enzyme Catalytic Domain
Mol. Mass.:
61154.85
Organism:
Homo sapiens (Human)
Description:
Adrenergic Alpha 0 HUMAN::O15245
Residue:
554
  
Inhibitor
Name:
BDBM50080092
Synonyms:
(17beta)-17-hydroxyestr-4-en-3-one 17beta-hydroxy-4-estren-3-one 19-Norandrostenolone 4-estren-17beta-ol-3-one Nandrolone
Type:
Small organic molecule
Emp. Form.:
C18H26O2
Mol. Mass.:
274.3978
SMILES:
C[C@]12CC[C@H]3[C@@H](CCC4=CC(=O)CC[C@H]34)[C@@H]1CC[C@@H]2O
: