Target
Kappa-type opioid receptor
Ligand
BDBM50292918
Substrate
Meas. Tech.
ChEMBL_495340 (CHEMBL1006332)
Ki
1.6±n/a nM
Citation
 Li, GAschenbach, LCChen, JCassidy, MPStevens, DLGabra, BHSelley, DEDewey, WLWestkaemper, RBZhang, Y Design, synthesis, and biological evaluation of 6alpha- and 6beta-N-heterocyclic substituted naltrexamine derivatives as mu opioid receptor selective antagonists. J Med Chem 52:1416-27 (2010)  
Target
Name:
Kappa-type opioid receptor
Synonyms:
K-OR-1 Kappa-opioid receptor (KOR) Kappa-type opioid receptor (KOR) OPIATE Kappa OPRK1 kappa opioid receptor (KOR)
Type:
G Protein-Coupled Receptor (GPCR)
Mol. Mass.:
42648.76
Organism:
Homo sapiens (Human)
Description:
P41145
Residue:
380
  
Inhibitor
Name:
BDBM50292918
Synonyms:
17-Cyclopropylmethyl-3,14beta-dihydroxy-4,5r-epoxy-6beta-[(3'-isoquinolyl)acetamido]morphinan | CHEMBL521854
Type:
Small organic molecule
Emp. Form.:
C30H31N3O4
Mol. Mass.:
497.5848
SMILES:
Oc1ccc2C[C@H]3N(CC4CC4)CC[C@@]45[C@@H](Oc1c24)[C@@H](CC[C@@]35O)NC(=O)c1cc2ccccc2cn1
: