Target
5-hydroxytryptamine receptor 2A
Ligand
BDBM50026916
Substrate
Meas. Tech.
ChEMBL_564940 (CHEMBL956718)
Ki
254±n/a nM
Citation
 Zajdel, PSubra, GVerdie, PBojarski, AJDuszynska, BBasista, KObniska, JMartinez, JPawlowski, M The influence of an ethylene spacer on the 5-HT(1A) and 5-HT(2A) receptor affinity of arylpiperazine derivatives of amides with N-acylated amino acids and 3-differently substituted pyrrolidine-2,5-diones. Eur J Med Chem 44:800-8 (2009)  
Target
Name:
5-hydroxytryptamine receptor 2A
Synonyms:
5-HT-2A 5-HT2A 5-hydroxytryptamine receptor 2A (5HT2A) Htr2 Serotonin Receptor 2A
Type:
G Protein-Coupled Receptor (GPCR)
Mol. Mass.:
52852.05
Organism:
Rattus norvegicus (rat)
Description:
Rat cortex membranes 5-HT2A receptors.
Residue:
471
  
Inhibitor
Name:
BDBM50026916
Synonyms:
2-(2-(4-(2-methoxyphenyl)piperazin-1-yl)ethyl)-2-azaspiro[4.5]decane-1,3-dione CHEMBL60322
Type:
Small organic molecule
Emp. Form.:
C22H31N3O3
Mol. Mass.:
385.4998
SMILES:
COc1ccccc1N1CCN(CCN2C(=O)CC3(CCCCC3)C2=O)CC1
: