Target
Mu-type opioid receptor
Ligand
BDBM50278385
Substrate
Meas. Tech.
ChEMBL_564842 (CHEMBL955069)
Ki
0.240000±n/a nM
Citation
 Wentland, MPLou, RLu, QBu, YDenhardt, CJin, JGanorkar, RVanAlstine, MAGuo, CCohen, DJBidlack, JM Syntheses of novel high affinity ligands for opioid receptors. Bioorg Med Chem Lett 19:2289-94 (2009)  
Target
Name:
Mu-type opioid receptor
Synonyms:
M-OR-1 MOR-1 MUOR1 Mu opiate receptor OPRM1 hMOP | mu-type opioid receptor isoform MOR-1
Type:
G Protein-Coupled Receptor (GPCR)
Mol. Mass.:
44789.51
Organism:
Homo sapiens (Human)
Description:
P35372
Residue:
400
  
Inhibitor
Name:
BDBM50278385
Synonyms:
6-desoxonaltrexone | CHEMBL511816
Type:
Small organic molecule
Emp. Form.:
C20H25NO3
Mol. Mass.:
327.4174
SMILES:
Oc1ccc2C[C@H]3N(CC4CC4)CC[C@]45[C@H](CCC[C@@]34O)Oc1c25
: