Target
Adenosine receptor A2b
Ligand
BDBM50268233
Substrate
Meas. Tech.
ChEMBL_520180 (CHEMBL948832)
Ki
0.473±n/a nM
Citation
 Borrmann, THinz, SBertarelli, DCLi, WFlorin, NCScheiff, ABMüller, CE 1-alkyl-8-(piperazine-1-sulfonyl)phenylxanthines: development and characterization of adenosine A2B receptor antagonists and a new radioligand with subnanomolar affinity and subtype specificity. J Med Chem 52:3994-4006 (2009)  
Target
Name:
Adenosine receptor A2b
Synonyms:
AA2BR_HUMAN ADORA2B Adenosine receptors A2b | Adenosine receptors; A2a & A2b
Type:
G Protein-Coupled Receptor (GPCR)
Mol. Mass.:
36341.22
Organism:
Homo sapiens (Human)
Description:
Residue:
332
  
Inhibitor
Name:
BDBM50268233
Synonyms:
8-(4-(4-(4-Chlorophenyl)piperazine-1-sulfonyl)phenyl)-1-prop-2-ynyl-3,7-dihydropurine-2,6-dione | CHEMBL519253
Type:
Small organic molecule
Emp. Form.:
C24H21ClN6O4S
Mol. Mass.:
524.979
SMILES:
Clc1ccc(cc1)N1CCN(CC1)S(=O)(=O)c1ccc(cc1)-c1nc2[nH]c(=O)n(CC#C)c(=O)c2[nH]1
: