Target
Carbonic anhydrase 5A, mitochondrial
Ligand
BDBM50300204
Substrate
Meas. Tech.
ChEMBL_592887 (CHEMBL1046632)
Ki
4565±n/a nM
Citation
 Temperini, CInnocenti, AScozzafava, AParkkila, SSupuran, CT The coumarin-binding site in carbonic anhydrase accommodates structurally diverse inhibitors: the antiepileptic lacosamide as an example and lead molecule for novel classes of carbonic anhydrase inhibitors. J Med Chem 53:850-4 (2010)  
Target
Name:
Carbonic anhydrase 5A, mitochondrial
Synonyms:
CA-VA CA5A Carbonate dehydratase VA Carbonic anhydrase 5A (CA VA) Carbonic anhydrase 5A, mitochondrial precursor Carbonic anhydrase VA (CA VA)
Type:
Enzyme
Mol. Mass.:
34755.54
Organism:
Homo sapiens (Human)
Description:
Human (cloned) isozyme
Residue:
305
  
Inhibitor
Name:
BDBM50300204
Synonyms:
(2R)-2-acetylamino-N-benzyl-3-methoxypropanamide (R)-2-acetamido-N-benzyl-3-methoxypropanamide (R)-N-benzyl 2-acetamido-3-methoxypropionamide, Erlosamide | LACOSAMIDE
Type:
Small organic molecule
Emp. Form.:
C13H18N2O3
Mol. Mass.:
250.2936
SMILES:
COC[C@@H](NC(C)=O)C(=O)NCc1ccccc1
: