Target
MAP kinase-activated protein kinase 2
Ligand
BDBM50366480
Substrate
Meas. Tech.
ChEMBL_606644 (CHEMBL1071871)
IC50
2800±n/a nM
Citation
 Argiriadi, MAEricsson, AMHarris, CMBanach, DLBorhani, DWCalderwood, DJDemers, MDDimauro, JDixon, RWHardman, JKwak, SLi, BMankovich, JAMarcotte, DMullen, KDNi, BPietras, MSadhukhan, RSousa, STomlinson, MJWang, LXiang, TTalanian, RV 2,4-Diaminopyrimidine MK2 inhibitors. Part I: Observation of an unexpected inhibitor binding mode. Bioorg Med Chem Lett 20:330-3 (2010)  
Target
Name:
MAP kinase-activated protein kinase 2
Synonyms:
MAP kinase-activated protein kinase 2 (MAPKAPK2) MAP kinase-activated protein kinase 2 (p38/MK2) MAPK-activated protein kinase 2 MAPKAP kinase 2 MAPKAPK2 | MK2
Type:
Serine/threonine-protein kinase
Mol. Mass.:
45579.87
Organism:
Homo sapiens (Human)
Description:
P49137
Residue:
400
  
Inhibitor
Name:
BDBM50366480
Synonyms:
ADENOSINE TRIPHOSPHATE | ATP
Type:
Small organic molecule
Emp. Form.:
C10H16N5O13P3
Mol. Mass.:
507.181
SMILES:
Nc1ncnc2n(cnc12)[C@@H]1O[C@H](CO[P@](O)(=O)O[P@@](O)(=O)OP(O)(O)=O)[C@@H](O)[C@H]1O
: