Target
Prostaglandin G/H synthase 2
Ligand
BDBM50074922
Substrate
Meas. Tech.
ChEMBL_613376 (CHEMBL1067574)
IC50
500±n/a nM
Citation
 Ehrman, TMBarlow, DJHylands, PJ In silico search for multi-target anti-inflammatories in Chinese herbs and formulas. Bioorg Med Chem 18:2204-18 (2010)  
Target
Name:
Prostaglandin G/H synthase 2
Synonyms:
Cox-2 Cyclooxygenase-2 Glucocorticoid-regulated inflammatory cyclooxygenase Macrophage activation-associated marker protein P71/73 PGH synthase 2 PGHS-2 Pghs-b Prostaglandin H2 synthase 2 Ptgs2 Tis10
Type:
Protein
Mol. Mass.:
69020.39
Organism:
Mus musculus (Mouse)
Description:
Q05769
Residue:
604
  
Inhibitor
Name:
BDBM50074922
Synonyms:
(+-)-2-fluoro-alpha-methyl-4-biphenylacetic acid 2-(2-fluorobiphenyl-4-yl)propanoic acid 3-fluoro-4-phenylhydratropic acid CHEMBL563 US9630914, Compound A
Type:
Small organic molecule
Emp. Form.:
C15H13FO2
Mol. Mass.:
244.2609
SMILES:
CC(C(O)=O)c1ccc(c(F)c1)-c1ccccc1
: