Target
Adenosine receptor A2a
Ligand
BDBM50315547
Substrate
Meas. Tech.
ChEMBL_627304 (CHEMBL1105450)
Ki
0.57±n/a nM
Citation
 Mishra, CBBarodia, SKPrakash, ASenthil Kumar, JBLuthra, PM Novel 8-(furan-2-yl)-3-substituted thiazolo [5,4-e][1,2,4] triazolo[1,5-c] pyrimidine-2(3H)-thione derivatives as potential adenosine A(2A) receptor antagonists. Bioorg Med Chem 18:2491-500 (2010)  
Target
Name:
Adenosine receptor A2a
Synonyms:
A2A adenosine receptor (hA2A) ADENOSINE A2 ADORA2 Adenosine A2A receptor (A2AAR)
Type:
G Protein-Coupled Receptor (GPCR)
Mol. Mass.:
44716.46
Organism:
Homo sapiens (Human)
Description:
P29274
Residue:
412
  
Inhibitor
Name:
BDBM50315547
Synonyms:
8-(2-Thioxo-7(3-p-iodophenyl)-2-(2-furyl)thiazolo[4,3-e]1,2,4-triazolo[1,5-c]pyrimidine | CHEMBL1093203
Type:
Small organic molecule
Emp. Form.:
C16H8IN5OS2
Mol. Mass.:
477.302
SMILES:
Ic1ccc(cc1)-n1c2ncn3nc(nc3c2sc1=S)-c1ccco1
: