Target
KiSS-1 receptor
Ligand
BDBM50322293
Substrate
Meas. Tech.
ChEMBL_642624 (CHEMBL1176639)
IC50
8.4±n/a nM
Citation
 Kobayashi, TSasaki, STomita, NFukui, SNakayama, MKiba, AKusaka, MMatsumoto, SYamaguchi, MItoh, FBaba, A 2-acylamino-4,6-diphenylpyridine derivatives as novel GPR54 antagonists with good brain exposure and in vivo efficacy for plasma LH level in male rats. Bioorg Med Chem 18:5157-71 (2010)  
Target
Name:
KiSS-1 receptor
Synonyms:
AXOR12 G-protein coupled receptor 54 (GPR54) Hypogonadotropin-1 KISSR_HUMAN Kisspeptins receptor hOT7T175
Type:
G Protein-Coupled Receptor (GPCR)
Mol. Mass.:
42613.79
Organism:
Homo sapiens (Human)
Description:
Binding assay was performed using membranes from the CHO cell transfectants.
Residue:
398
  
Inhibitor
Name:
BDBM50322293
Synonyms:
CHEMBL1170911 | N-[3-Cyano-6-(4-fluoro-2-hydroxyphenyl)-4-{3-[(N-methylglycyl)amino]phenyl}pyridin-2-yl]furan-2-carboxamide
Type:
Small organic molecule
Emp. Form.:
C26H20FN5O4
Mol. Mass.:
485.4665
SMILES:
CNCC(=O)Nc1cccc(c1)-c1cc(nc(NC(=O)c2ccco2)c1C#N)-c1ccc(F)cc1O
: