Target
Macrophage migration inhibitory factor
Ligand
BDBM50326573
Substrate
Meas. Tech.
ChEMBL_661809 (CHEMBL1252125)
IC50
420±n/a nM
Citation
 El Turk, FFauvet, BOuertatani-Sakouhi, HLugari, ABetzi, SRoche, PMorelli, XLashuel, HA An integrative in silico methodology for the identification of modulators of macrophage migration inhibitory factor (MIF) tautomerase activity. Bioorg Med Chem 18:5425-40 (2010)  
Target
Name:
Macrophage migration inhibitory factor
Synonyms:
GIF Glycosylation-inhibiting factor L-dopachrome tautomerase MIF/CD74 (Macrophage migration inhibitory factor and HLA-DR antigens-associated invariant chain) MMIF Macrophage migration inhibitory factor (MIF) | Phenylpyruvate tautomerase
Type:
Enzyme
Mol. Mass.:
12478.18
Organism:
Homo sapiens (Human)
Description:
P14174
Residue:
115
  
Inhibitor
Name:
BDBM50326573
Synonyms:
1-Phenyl-3-(2-thiazolyl)-2-thiourea CHEMBL1253381
Type:
Small organic molecule
Emp. Form.:
C9H8N4S2
Mol. Mass.:
236.317
SMILES:
S=C(Nc1nncs1)Nc1ccccc1
: