Target
Coagulation factor X
Ligand
BDBM19023
Substrate
Meas. Tech.
ChEMBL_675275 (CHEMBL1273257)
Ki
0.08±n/a nM
Citation
 Pinto, DJSmallheer, JMCheney, DLKnabb, RMWexler, RR Factor Xa inhibitors: next-generation antithrombotic agents. J Med Chem 53:6243-74 (2010)  
Target
Name:
Coagulation factor X
Synonyms:
Activated coagulation factor X (FXa) Coagulation factor X precursor F10 Factor X heavy chain Factor Xa Stuart-Prower factor
Type:
Enzyme
Mol. Mass.:
54726.60
Organism:
Homo sapiens (Human)
Description:
Residue:
488
  
Inhibitor
Name:
BDBM19023
Synonyms:
1-(4-methoxyphenyl)-7-oxo-6-[4-(2-oxopiperidin-1-yl)phenyl]-1H,4H,5H,6H,7H-pyrazolo[3,4-c]pyridine-3-carboxamide BMS-562247 US9938272, Example Apixaban
Type:
Small organic molecule
Emp. Form.:
C25H25N5O4
Mol. Mass.:
459.4971
SMILES:
COc1ccc(cc1)-n1nc(C(N)=O)c2CCN(C(=O)c12)c1ccc(cc1)N1CCCCC1=O
: