Target
Peptidase
Ligand
BDBM50350483
Substrate
Meas. Tech.
ChEMBL_677175 (CHEMBL1278933)
IC50
710000±n/a nM
Citation
 Chung, MAntignac, AKim, CTomasz, A Comparative study of the susceptibilities of major epidemic clones of methicillin-resistant Staphylococcus aureus to oxacillin and to the new broad-spectrum cephalosporin ceftobiprole. Antimicrob Agents Chemother 52:2709-17 (2008)  
Target
Name:
Peptidase
Synonyms:
MecA Penicillin binding protein 2 prime Penicillin binding protein 2a (PBP2a) Penicillin-binding protein 2'
Type:
PROTEIN
Mol. Mass.:
76113.18
Organism:
Staphylococcus aureus
Description:
ChEMBL_677175
Residue:
668
  
Inhibitor
Name:
BDBM50350483
Synonyms:
Bactocill | OXACILLIN
Type:
Small organic molecule
Emp. Form.:
C19H19N3O5S
Mol. Mass.:
401.436
SMILES:
Cc1onc(c1C(=O)N[C@H]1[C@H]2SC(C)(C)[C@@H](N2C1=O)C(O)=O)-c1ccccc1
: