Target
MBT domain-containing protein 1
Ligand
BDBM35938
Substrate
Meas. Tech.
ChEMBL_684951 (CHEMBL1286366)
IC50
34000±n/a nM
Citation
 Kireev, DWigle, TJNorris-Drouin, JHerold, JMJanzen, WPFrye, SV Identification of non-peptide malignant brain tumor (MBT) repeat antagonists by virtual screening of commercially available compounds. J Med Chem 53:7625-31 (2010)  
Target
Name:
MBT domain-containing protein 1
Synonyms:
MBT domain-containing protein 1 MBTD1 | MBTD1_HUMAN
Type:
Protein
Mol. Mass.:
70557.67
Organism:
Homo sapiens (Human)
Description:
Residue:
628
  
Inhibitor
Name:
BDBM35938
Synonyms:
1-(p-chlorophenyl)-1-(2-pyridyl)-3-N,N-dimethylpropylamine 3-(p-chlorophenyl)-3-(2-pyridyl)-N,N-dimethylpropylamine CHEMBL505 CHLORPHENIRAMINE MALEATE Polaramine [3H]Chlorphenamine chlorophenylpyridamine clorfeniramina gamma-(4-chlorophenyl)-N,N-dimethyl-2-pyridinepropanamine | gamma-(4-chlorophenyl)-gamma-(2-pyridyl)propyldimethylamine
Type:
radiolabeled ligand
Emp. Form.:
C16H19ClN2
Mol. Mass.:
274.788
SMILES:
CN(C)CCC(c1ccc(Cl)cc1)c1ccccn1
: