Target
Pteridine reductase 1
Ligand
BDBM30705
Substrate
Meas. Tech.
ChEMBL_702837 (CHEMBL1655367)
Ki
4000±n/a nM
Citation
 Shi, KHuang, QHuang, YLee, TCYu, H Reducing the brittleness of zein films through chemical modification. J Agric Food Chem 59:56-61 (2011)  
Target
Name:
Pteridine reductase 1
Synonyms:
HMTXR PTR1_LEIMA
Type:
PROTEIN
Mol. Mass.:
30459.34
Organism:
Leishmania major
Description:
ChEMBL_1470027
Residue:
288
  
Inhibitor
Name:
BDBM30705
Synonyms:
CHEMBL744 RILUZOLE cid_5070
Type:
Small organic molecule
Emp. Form.:
C8H5F3N2OS
Mol. Mass.:
234.198
SMILES:
Nc1nc2ccc(OC(F)(F)F)cc2s1
: