Target
Tyrosine-protein kinase JAK2
Ligand
BDBM50335207
Substrate
Meas. Tech.
ChEMBL_701696 (CHEMBL1656588)
IC50
16±n/a nM
Citation
 Ioannidis, SLamb, MLWang, TAlmeida, LBlock, MHDavies, AMPeng, BSu, MZhang, HJHoffmann, ERivard, CGreen, IHoward, TPollard, HRead, JAlimzhanov, MBebernitz, GBell, KYe, MHuszar, DZinda, M Discovery of 5-chloro-N2-[(1S)-1-(5-fluoropyrimidin-2-yl)ethyl]-N4-(5-methyl-1H-pyrazol-3-yl)pyrimidine-2,4-diamine (AZD1480) as a novel inhibitor of the Jak/Stat pathway. J Med Chem 54:262-76 (2011)  
Target
Name:
Tyrosine-protein kinase JAK2
Synonyms:
JAK-2 JAK2_HUMAN Janus kinase 2 (JAK2) | Janus kinase 2 (a protein tyrosine kinase)
Type:
Protein
Mol. Mass.:
130684.68
Organism:
Homo sapiens (Human)
Description:
O60674
Residue:
1132
  
Inhibitor
Name:
BDBM50335207
Synonyms:
CHEMBL1650731 | N4-[5-(dimethylamino)-1H-pyrazol-3-yl]-5-fluoro-N2-[(1S)-1-(5-fluoropyrimidin-2-yl)ethyl]pyrimidine-2,4-diamine
Type:
Small organic molecule
Emp. Form.:
C15H17F2N9
Mol. Mass.:
361.3526
SMILES:
C[C@H](Nc1ncc(F)c(Nc2cc(n[nH]2)N(C)C)n1)c1ncc(F)cn1
: