Target
Procathepsin L
Ligand
BDBM50335280
Substrate
Meas. Tech.
ChEMBL_702782 (CHEMBL1655225)
Ki
0.39±n/a nM
Citation
 Frizler, MLohr, FFurtmann, NKläs, JGütschow, M Structural optimization of azadipeptide nitriles strongly increases association rates and allows the development of selective cathepsin inhibitors. J Med Chem 54:396-400 (2011)  
Target
Name:
Procathepsin L
Synonyms:
CATL1_HUMAN CTSL CTSL1 Cathepsin L Cathepsin L1 heavy chain MEP cathepsin L preproprotein
Type:
Enzyme
Mol. Mass.:
37557.19
Organism:
Homo sapiens (Human)
Description:
Purchased from Calbiochem (San Diego, CA).
Residue:
333
  
Inhibitor
Name:
BDBM50335280
Synonyms:
CHEMBL1651354 acs.jmedchem.1c00409_ST.408
Type:
Small organic molecule
Emp. Form.:
C17H25N5O2
Mol. Mass.:
331.4127
SMILES:
CC(C)C[C@H](NC(=O)NCc1ccccc1)C(=O)N(C)N(C)C#N
: