Target
Cytochrome P450 2C9
Ligand
BDBM50336715
Substrate
Meas. Tech.
ChEMBL_718212 (CHEMBL1679258)
IC50
>40000±n/a nM
Citation
 Sams, AGMikkelsen, GKLarsen, MLanggård, MHowells, MESchrøder, TJBrennum, LTTorup, LJørgensen, EBBundgaard, CKreilgård, MBang-Andersen, B Discovery of phosphoric acid mono-{2-[(E/Z)-4-(3,3-dimethyl-butyrylamino)-3,5-difluoro-benzoylimino]-thiazol-3-ylmethyl} ester (Lu AA47070): a phosphonooxymethylene prodrug of a potent and selective hA(2A) receptor antagonist. J Med Chem 54:751-64 (2012)  
Target
Name:
Cytochrome P450 2C9
Synonyms:
(R)-limonene 6-monooxygenase CP2C9_HUMAN CYP2C9 Cytochrome P450 2C9 (CYP2C9 ) P-450MP P450 PB-1 | S-mephenytoin 4-hydroxylase
Type:
Enzyme
Mol. Mass.:
55636.33
Organism:
Homo sapiens (Human)
Description:
P11712
Residue:
490
  
Inhibitor
Name:
BDBM50336715
Synonyms:
4-(3,3-Dimethyl-butyrylamino)-3,5-difluoro-N-thiazol-2-yl-benzamide | CHEMBL1671936
Type:
Small organic molecule
Emp. Form.:
C16H17F2N3O2S
Mol. Mass.:
353.387
SMILES:
CC(C)(C)CC(=O)Nc1c(F)cc(cc1F)C(=O)Nc1nccs1
: