Target
Glutathione reductase, mitochondrial
Ligand
BDBM50352165
Substrate
Meas. Tech.
ChEMBL_767323 (CHEMBL1825435)
Ki
54600±n/a nM
Citation
 Çakmak, RDurdagi, SEkinci, DSentürk, MTopal, G Design, synthesis and biological evaluation of novel nitroaromatic compounds as potent glutathione reductase inhibitors. Bioorg Med Chem Lett 21:5398-402 (2011)  
Target
Name:
Glutathione reductase, mitochondrial
Synonyms:
GLUR GSHR_HUMAN Glutathione reductase | Glutathione reductase (GR)
Type:
Enzyme
Mol. Mass.:
56271.52
Organism:
Homo sapiens (Human)
Description:
P00390
Residue:
522
  
Inhibitor
Name:
BDBM50352165
Synonyms:
LYSINE
Type:
Small organic molecule
Emp. Form.:
C6H15N2O2
Mol. Mass.:
147.195
SMILES:
N[C@@H](CCCC[NH3+])C(O)=O
: