Target
Serine/threonine-protein kinase Chk1
Ligand
BDBM50379548
Substrate
Meas. Tech.
ChEMBL_811468 (CHEMBL2013769)
IC50
5±n/a nM
Citation
 Oza, VAshwell, SBrassil, PBreed, JEzhuthachan, JDeng, CGrondine, MHorn, CLiu, DLyne, PNewcombe, NPass, MRead, JSu, MToader, DYu, DYu, YZabludoff, S Synthesis and evaluation of triazolones as checkpoint kinase 1 inhibitors. Bioorg Med Chem Lett 22:2330-7 (2012)  
Target
Name:
Serine/threonine-protein kinase Chk1
Synonyms:
CHEK1 CHK1 checkpoint homolog Checkpoint kinase-1 (CHK1)
Type:
Enzyme Catalytic Domain
Mol. Mass.:
54443.02
Organism:
Homo sapiens (Human)
Description:
gi_166295192
Residue:
476
  
Inhibitor
Name:
BDBM50379548
Synonyms:
CHEMBL2012858
Type:
Small organic molecule
Emp. Form.:
C16H15N5OS
Mol. Mass.:
325.388
SMILES:
CNCc1cc(cs1)-c1ccc2c(N)cc3n[nH]c(=O)n3c2c1
: