Target
Carboxylic ester hydrolase
Ligand
BDBM23418
Substrate
Meas. Tech.
ChEMBL_811773 (CHEMBL2014394)
IC50
1774100±n/a nM
Citation
 Cho, JKRyu, YBCurtis-Long, MJRyu, HWYuk, HJKim, DWKim, HJLee, WSPark, KH Cholinestrase inhibitory effects of geranylated flavonoids from Paulownia tomentosa fruits. Bioorg Med Chem 20:2595-602 (2012)  
Target
Name:
Carboxylic ester hydrolase
Synonyms:
BuChE Butyrylcholine esterase Butyrylcholinesterase (BChE) Butyrylcholinesterase (EqBuChE) butyrylcholinesterase precursor
Type:
Protein
Mol. Mass.:
68842.83
Organism:
Equus caballus (Horse)
Description:
Q9N1N9
Residue:
602
  
Inhibitor
Name:
BDBM23418
Synonyms:
(2S)-5,7-dihydroxy-2-(3-hydroxy-4-methoxyphenyl)-3,4-dihydro-2H-1-benzopyran-4-one Hesperitin
Type:
flavanone
Emp. Form.:
C16H14O6
Mol. Mass.:
302.2788
SMILES:
COc1ccc(cc1O)[C@@H]1CC(=O)c2c(O)cc(O)cc2O1
: