Target
Nucleotide-binding oligomerization domain-containing protein 1
Ligand
BDBM62261
Substrate
Meas. Tech.
ChEMBL_812915 (CHEMBL2020290)
IC50
240±n/a nM
Citation
 Khan, PMCorrea, RGDivlianska, DBPeddibhotla, SSessions, EHMagnuson, GBrown, BSuyama, EYuan, HMangravita-Novo, AVicchiarelli, MSu, YVasile, SSmith, LHDiaz, PWReed, JCRoth, GP Identification of Inhibitors of NOD1-Induced Nuclear Factor-żB Activation. ACS Med Chem Lett 2:780-785 (2011)  
Target
Name:
Nucleotide-binding oligomerization domain-containing protein 1
Synonyms:
CARD4 NOD1_HUMAN | nucleotide-binding oligomerization domain containing 1
Type:
Enzyme Catalytic Domain
Mol. Mass.:
107699.03
Organism:
Homo sapiens (Human)
Description:
gi_5174617
Residue:
953
  
Inhibitor
Name:
BDBM62261
Synonyms:
4-(3,4-dihydro-1H-isoquinolin-2-ylmethyl)-N-(4-methylsulfanylphenyl)benzamide MLS-0412148.0001 | cid_44182149
Type:
Small organic molecule
Emp. Form.:
C24H24N2OS
Mol. Mass.:
388.525
SMILES:
CSc1ccc(NC(=O)c2ccc(CN3CCc4ccccc4C3)cc2)cc1
: